- De sistema operativo tengo ArchLinux, probe a hacer repo sync de nuevo y sigue saliendo el error..
(El error veo donde esta pero no consigo solucionarlo)
(Click para mostrar/ocultar)
Traceback (most recent call last):
File "../build/scripts/make_css_property_names.py", line 255, in <module>
in_generator.Maker(CSSPropertiesWriter).main(sys.a rgv)
File "/home/evelin/android/pac/external/chromium_org/third_party/WebKit/Source/build/scripts/in_generator.py", line 99, in main
writer.write_files(options.output_dir)
File "/home/evelin/android/pac/external/chromium_org/third_party/WebKit/Source/build/scripts/in_generator.py", line 79, in write_files
self._write_file(output_dir, generator(), file_name)
File "../build/scripts/make_css_property_names.py", line 250, in generate_implementation
gperf = subprocess.Popen(gperf_args, stdin=subprocess.PIPE, stdout=subprocess.PIPE)
File "/usr/lib64/python2.7/subprocess.py", line 710, in __init__
errread, errwrite)
File "/usr/lib64/python2.7/subprocess.py", line 1327, in _execute_child
raise child_exception
OSError: [Errno 2] No such file or directory
external/chromium_org/third_party/WebKit/Source/core/make_core_derived_sources.target.linux-arm.mk:64: recipe for target '/home/evelin/android/pac/out/target/product/mako/obj/GYP/shared_intermediates/blink/CSSPropertyNames.cpp' failed
make: *** [/home/evelin/android/pac/out/target/product/mako/obj/GYP/shared_intermediates/blink/CSSPropertyNames.cpp] Error 1
make: *** Se espera a que terminen otras tareas....
Traceback (most recent call last):
File "../build/scripts/make_css_value_keywords.py", line 177, in <module>
in_generator.Maker(CSSValueKeywordsWriter).main(sy s.argv)
File "/home/evelin/android/pac/external/chromium_org/third_party/WebKit/Source/build/scripts/in_generator.py", line 99, in main
writer.write_files(options.output_dir)
File "/home/evelin/android/pac/external/chromium_org/third_party/WebKit/Source/build/scripts/in_generator.py", line 79, in write_files
self._write_file(output_dir, generator(), file_name)
File "../build/scripts/make_css_value_keywords.py", line 172, in generate_implementation
gperf = subprocess.Popen(gperf_args, stdin=subprocess.PIPE, stdout=subprocess.PIPE)
File "/usr/lib64/python2.7/subprocess.py", line 710, in __init__
errread, errwrite)
File "/usr/lib64/python2.7/subprocess.py", line 1327, in _execute_child
raise child_exception OSError: [Errno 2] No such file or directory
external/chromium_org/third_party/WebKit/Source/core/make_core_derived_sources.target.linux-arm.mk:98: recipe for target '/home/evelin/android/pac/out/target/product/mako/obj/GYP/shared_intermediates/blink/CSSValueKeywords.cpp' failed
make: *** [/home/evelin/android/pac/out/target/product/mako/obj/GYP/shared_intermediates/blink/CSSValueKeywords.cpp] Error 1
/home/evelin/android/pac/out/target/product/mako/pac_mako-ota-eng.evelin.zip doesn't exist!
Total time elapsed: 1 minutes 31 seconds